Target
Mitogen-activated protein kinase 9
Ligand
BDBM50310984
Substrate
Meas. Tech.
ChEMBL_618898 (CHEMBL1101789)
IC50
>171000±n/a nM
Citation
 Selness, SRDevraj, RVMonahan, JBBoehm, TLWalker, JKDevadas, BDurley, RCKurumbail, RShieh, HXing, LHepperle, MRucker, PVJerome, KDBenson, AGMarrufo, LDMadsen, HMHitchcock, JOwen, TJChristie, LPromo, MAHickory, BSAlvira, ENaing, WBlevis-Bal, R Discovery of N-substituted pyridinones as potent and selective inhibitors of p38 kinase. Bioorg Med Chem Lett 19:5851-6 (2009)  
Target
Name:
Mitogen-activated protein kinase 9
Synonyms:
JNK-55 JNK2/JNK3 MK09_HUMAN Mitogen-activated protein kinase 8/9 SAPK1A c-Jun N-terminal kinase 2 | c-Jun N-terminal kinase 2 (JNK2)
Type:
Enzyme
Mol. Mass.:
48131.49
Organism:
Homo sapiens (Human)
Description:
JNK-2 was purchased from Upstate Cell Signaling Solutions (formerly Upstate Biotechnology).
Residue:
424
  
Inhibitor
Name:
BDBM50310984
Synonyms:
3-bromo-4-(2,4-difluorobenzyloxy)-1-(4-((dimethylamino)methyl)benzyl)-6-methylpyridin-2(1H)-one PHA-745052
Type:
Small organic molecule
Emp. Form.:
C23H23BrF2N2O2
Mol. Mass.:
477.342
SMILES:
CN(C)Cc1ccc(Cn2c(C)cc(OCc3ccc(F)cc3F)c(Br)c2=O)cc1
: