Target
Type-2 angiotensin II receptor
Ligand
BDBM50156173
Substrate
Meas. Tech.
ChEMBL_637186 (CHEMBL1167160)
Ki
0.4±n/a nM
Citation
 Mahalingam, AKWan, YMurugaiah, AMWallinder, CWu, XPlouffe, BBotros, MNyberg, FHallberg, AGallo-Payet, NAlterman, M Selective angiotensin II AT(2) receptor agonists with reduced CYP 450 inhibition. Bioorg Med Chem 18:4570-90 (2010)  
Target
Name:
Type-2 angiotensin II receptor
Synonyms:
Angiotensin type II receptor
Type:
PROTEIN
Mol. Mass.:
15474.49
Organism:
Sus scrofa
Description:
ChEMBL_1285617
Residue:
137
  
Inhibitor
Name:
BDBM50156173
Synonyms:
(1-((2'-(1H-tetrazol-5-yl)biphenyl-4-yl)methyl)-2-butyl-4-chloro-1H-imidazol-5-yl)methanol butyl (5-isobutylthien-2-yl)sulfonylcarbamate derivative | butyl 3-(4-((1H-imidazol-1-yl)methyl)phenyl)-5-isobutylthiophen-2-ylsulfonylcarbamate
Type:
Small organic molecule
Emp. Form.:
C23H29N3O4S2
Mol. Mass.:
475.624
SMILES:
CCCCOC(=O)NS(=O)(=O)c1sc(CC(C)C)cc1-c1ccc(Cn2ccnc2)cc1
: