Target
Sigma non-opioid intracellular receptor 1
Ligand
BDBM50322245
Substrate
Meas. Tech.
ChEMBL_642593 (CHEMBL1176482)
Ki
1.2±n/a nM
Citation
 Vangveravong, STaylor, MXu, JCui, JCalvin, WBabic, SLuedtke, RRMach, RH Synthesis and characterization of selective dopamine D2 receptor antagonists. 2. Azaindole, benzofuran, and benzothiophene analogs of L-741,626. Bioorg Med Chem 18:5291-300 (2010)  
Target
Name:
Sigma non-opioid intracellular receptor 1
Synonyms:
OPRS1 SIGMAR1 Sigma non-opioid intracellular receptor 1 Sigma1-receptor Sterol isomerase-like protein
Type:
Protein
Mol. Mass.:
25307.17
Organism:
Cavia porcellus (Guinea pig)
Description:
Q60492
Residue:
223
  
Inhibitor
Name:
BDBM50322245
Synonyms:
1-((1H-Pyrrolo[2,3-b]pyridine-3-yl)methyl)-4-(4-iodophenyl)piperidin-4-ol oxalate | CHEMBL1172208
Type:
Small organic molecule
Emp. Form.:
C19H20IN3O
Mol. Mass.:
433.2861
SMILES:
OC1(CCN(Cc2c[nH]c3ncccc23)CC1)c1ccc(I)cc1
: