Target
D(2) dopamine receptor
Ligand
BDBM50322245
Substrate
Meas. Tech.
ChEMBL_642589 (CHEMBL1176478)
Ki
61±n/a nM
Citation
 Vangveravong, STaylor, MXu, JCui, JCalvin, WBabic, SLuedtke, RRMach, RH Synthesis and characterization of selective dopamine D2 receptor antagonists. 2. Azaindole, benzofuran, and benzothiophene analogs of L-741,626. Bioorg Med Chem 18:5291-300 (2010)  
Target
Name:
D(2) dopamine receptor
Synonyms:
D(2) dopamine receptor DOPAMINE D2 Long DRD2 Dopamine D2 receptor Dopamine D2 receptor (D2R) Dopamine2-like | d2
Type:
Cell-surface receptors
Mol. Mass.:
50647.10
Organism:
Homo sapiens (Human)
Description:
P14416
Residue:
443
  
Inhibitor
Name:
BDBM50322245
Synonyms:
1-((1H-Pyrrolo[2,3-b]pyridine-3-yl)methyl)-4-(4-iodophenyl)piperidin-4-ol oxalate | CHEMBL1172208
Type:
Small organic molecule
Emp. Form.:
C19H20IN3O
Mol. Mass.:
433.2861
SMILES:
OC1(CCN(Cc2c[nH]c3ncccc23)CC1)c1ccc(I)cc1
: