Target
Cyclin-dependent kinase 1
Ligand
BDBM7646
Substrate
Meas. Tech.
ChEMBL_660572 (CHEMBL1250280)
IC50
5±n/a nM
Citation
 Sridhar, JAkula, NPattabiraman, N Selectivity and potency of cyclin-dependent kinase inhibitors. AAPS J 8:204-21 (2006)  
Target
Name:
Cyclin-dependent kinase 1
Synonyms:
CDC2 CDK1 CDKN1 Cell division protein kinase 1 P34CDC2 | p34 protein kinase
Type:
Enzyme Subunit
Mol. Mass.:
34101.08
Organism:
Homo sapiens (Human)
Description:
P06493
Residue:
297
  
Inhibitor
Name:
BDBM7646
Synonyms:
CHEMBL102926 N-{4-[3-(dimethylamino)-2-hydroxypropoxy]phenyl}-4-{2-methylimidazo[1,2-a]pyridin-3-yl}pyrimidin-2-amine
Type:
Small organic molecule
Emp. Form.:
C23H26N6O2
Mol. Mass.:
418.4915
SMILES:
CN(C)CC(O)COc1ccc(Nc2nccc(n2)-c2c(C)nc3ccccn23)cc1
: