Target
Amine oxidase [flavin-containing] B
Ligand
BDBM11022
Substrate
Meas. Tech.
ChEMBL_661996 (CHEMBL1251644)
IC50
18754±n/a nM
Citation
 Chimenti, FSecci, DBolasco, AChimenti, PGranese, ACarradori, SMaccioni, ECardia, MCYáñez, MOrallo, FAlcaro, SOrtuso, FCirilli, RFerretti, RDistinto, SKirchmair, JLanger, T Synthesis, semipreparative HPLC separation, biological evaluation, and 3D-QSAR of hydrazothiazole derivatives as human monoamine oxidase B inhibitors. Bioorg Med Chem 18:5063-70 (2010)  
Target
Name:
Amine oxidase [flavin-containing] B
Synonyms:
AOFB_HUMAN MAOB Monoamine oxidase type B (MAO B) Monoamine oxidase type B (MAOB)
Type:
Protein
Mol. Mass.:
58768.76
Organism:
Homo sapiens (Human)
Description:
P27338
Residue:
520
  
Inhibitor
Name:
BDBM11022
Synonyms:
2,3-dihydro-1H-indole-2,3-dione Isatin | Isatin (Compound 1)
Type:
Small organic molecule
Emp. Form.:
C8H5NO2
Mol. Mass.:
147.1308
SMILES:
O=C1Nc2ccccc2C1=O
: