Target
Outer membrane protein MIP
Ligand
BDBM50335227
Substrate
Meas. Tech.
ChEMBL_701873 (CHEMBL1657165)
IC50
32000±n/a nM
Citation
 Juli, CSippel, MJäger, JThiele, AWeiwad, MSchweimer, KRösch, PSteinert, MSotriffer, CAHolzgrabe, U Pipecolic acid derivatives as small-molecule inhibitors of the Legionella MIP protein. J Med Chem 54:277-83 (2011)  
Target
Name:
Outer membrane protein MIP
Synonyms:
MIP_LEGPN PPIase Rotamase | mip
Type:
PROTEIN
Mol. Mass.:
24869.94
Organism:
Legionella pneumophila
Description:
ChEMBL_701873
Residue:
233
  
Inhibitor
Name:
BDBM50335227
Synonyms:
3-(pyridin-3-yl)propyl 1-(3-nitrophenylsulfonyl)piperidine-2-carboxylate | CHEMBL1650948
Type:
Small organic molecule
Emp. Form.:
C20H23N3O6S
Mol. Mass.:
433.478
SMILES:
[O-][N+](=O)c1cccc(c1)S(=O)(=O)N1CCCCC1C(=O)OCCCc1cccnc1
: