Target
Peroxisome proliferator-activated receptor alpha
Ligand
BDBM50176605
Substrate
Meas. Tech.
ChEMBL_702774 (CHEMBL1655217)
EC50
12±n/a nM
Citation
 Ohashi, MOyama, TNakagome, ISatoh, MNishio, YNobusada, HHirono, SMorikawa, KHashimoto, YMiyachi, H Design, synthesis, and structural analysis of phenylpropanoic acid-type PPAR¿-selective agonists: discovery of reversed stereochemistry-activity relationship. J Med Chem 54:331-41 (2011)  
Target
Name:
Peroxisome proliferator-activated receptor alpha
Synonyms:
NR1C1 PPAR PPAR-alpha PPARA_HUMAN Peroxisome proliferator-activated receptor | Peroxisome proliferator-activated receptor alpha (PPAR alpha)
Type:
Enzyme
Mol. Mass.:
52222.08
Organism:
Homo sapiens (Human)
Description:
Q07869
Residue:
468
  
Inhibitor
Name:
BDBM50176605
Synonyms:
(S)-2-(3-((3-fluoro-4-(trifluoromethyl)benzamido)methyl)-4-methoxybenzyl)butanoic acid | CHEMBL202118
Type:
Small organic molecule
Emp. Form.:
C21H21F4NO4
Mol. Mass.:
427.3894
SMILES:
CC[C@@H](Cc1ccc(OC)c(CNC(=O)c2ccc(c(F)c2)C(F)(F)F)c1)C(O)=O
: