Target
Polyunsaturated fatty acid 5-lipoxygenase
Ligand
BDBM50341271
Substrate
Meas. Tech.
ChEMBL_742516 (CHEMBL1769275)
IC50
190±n/a nM
Citation
 Hofmann, BBarzen, SRödl, CBKiehl, ABorig, JZivkovic, AStark, HSchneider, GSteinhilber, D A class of 5-benzylidene-2-phenylthiazolinones with high potency as direct 5-lipoxygenase inhibitors. J Med Chem 54:1943-7 (2011)  
Target
Name:
Polyunsaturated fatty acid 5-lipoxygenase
Synonyms:
5-LO 5-Lipoxygenase (5-LO) 5-Lipoygenase ALOX5 LOG5 | LOX5_HUMAN
Type:
Enzyme
Mol. Mass.:
77972.74
Organism:
Homo sapiens (Human)
Description:
Recombinant protein was purified from E. coli lysate. After ammonium sulfate precipitation and subsequent steps, the supernatant (S100) was used for 5-LO activity assay.
Residue:
674
  
Inhibitor
Name:
BDBM50341271
Synonyms:
(Z)-Methyl-2-(4-((4-oxo-2-(p-tolyl)-4H-thiazol-5-ylidene)methyl)phenoxy)acetate | CHEMBL1765901
Type:
Small organic molecule
Emp. Form.:
C20H17NO4S
Mol. Mass.:
367.418
SMILES:
COC(=O)COc1ccc(\C=C2/SC(=NC2=O)c2ccc(C)cc2)cc1
: