Target
Insulin receptor
Ligand
BDBM50382959
Substrate
Meas. Tech.
ChEMBL_817988 (CHEMBL2033414)
Kd
>10000±n/a nM
Citation
 Rowbottom, MWFaraoni, RChao, QCampbell, BTLai, AGSetti, EEzawa, MSprankle, KGAbraham, STran, LStruss, BGibney, MArmstrong, RCGunawardane, RNNepomuceno, RRValenta, IHua, HGardner, MFCramer, MDGitnick, DInsko, DEApuy, JLJones-Bolin, SGhose, AKHerbertz, TAtor, MADorsey, BDRuggeri, BWilliams, MBhagwat, SJames, JHolladay, MW Identification of 1-(3-(6,7-dimethoxyquinazolin-4-yloxy)phenyl)-3-(5-(1,1,1-trifluoro-2-methylpropan-2-yl)isoxazol-3-yl)urea hydrochloride (CEP-32496), a highly potent and orally efficacious inhibitor of V-RAF murine sarcoma viral oncogene homologue B1 (BRAF) V600E. J Med Chem 55:1082-105 (2012)  
Target
Name:
Insulin receptor
Synonyms:
INSR INSR_HUMAN Insulin receptor beta subunit
Type:
Receptor Tyrosine Kinase
Mol. Mass.:
156322.60
Organism:
Homo sapiens (Human)
Description:
P06213
Residue:
1382
  
Inhibitor
Name:
BDBM50382959
Synonyms:
CEP-32496 US9730937, Example 261
Type:
Small organic molecule
Emp. Form.:
C24H22F3N5O5
Mol. Mass.:
517.4572
SMILES:
COc1cc2ncnc(Oc3cccc(NC(=O)Nc4cc(on4)C(C)(C)C(F)(F)F)c3)c2cc1OC
: