Target
Hepatocyte growth factor receptor
Ligand
BDBM50382959
Substrate
Meas. Tech.
ChEMBL_817996 (CHEMBL2033422)
Kd
513±n/a nM
Citation
 Rowbottom, MWFaraoni, RChao, QCampbell, BTLai, AGSetti, EEzawa, MSprankle, KGAbraham, STran, LStruss, BGibney, MArmstrong, RCGunawardane, RNNepomuceno, RRValenta, IHua, HGardner, MFCramer, MDGitnick, DInsko, DEApuy, JLJones-Bolin, SGhose, AKHerbertz, TAtor, MADorsey, BDRuggeri, BWilliams, MBhagwat, SJames, JHolladay, MW Identification of 1-(3-(6,7-dimethoxyquinazolin-4-yloxy)phenyl)-3-(5-(1,1,1-trifluoro-2-methylpropan-2-yl)isoxazol-3-yl)urea hydrochloride (CEP-32496), a highly potent and orally efficacious inhibitor of V-RAF murine sarcoma viral oncogene homologue B1 (BRAF) V600E. J Med Chem 55:1082-105 (2012)  
Target
Name:
Hepatocyte growth factor receptor
Synonyms:
Hepatocyte growth factor receptor Hepatocyte growth factor receptor (c-MET) MET Met proto-oncogene (hepatocyte growth factor receptor) Tyrosine-protein kinase Met (c-Met) c-Met kinase
Type:
Protein
Mol. Mass.:
155559.73
Organism:
Homo sapiens (Human)
Description:
P08581
Residue:
1390
  
Inhibitor
Name:
BDBM50382959
Synonyms:
CEP-32496 US9730937, Example 261
Type:
Small organic molecule
Emp. Form.:
C24H22F3N5O5
Mol. Mass.:
517.4572
SMILES:
COc1cc2ncnc(Oc3cccc(NC(=O)Nc4cc(on4)C(C)(C)C(F)(F)F)c3)c2cc1OC
: