Target
Integrin alpha-V/beta-3
Ligand
BDBM50134778
Substrate
Meas. Tech.
ChEMBL_819401 (CHEMBL2033068)
IC50
0.3±n/a nM
Citation
 Delouvrié, BAl-Kadhimi, KArnould, JCBarry, STCross, DADidelot, MGavine, PRGermain, HHarris, CSHughes, AMJude, DAKendrew, JLambert-van der Brempt, CLohmann, JJMénard, MMortlock, AAPass, MRooney, CVautier, MVincent, JLWarin, N Structure-activity relationship of a series of non peptidic RGD integrin antagonists targetinga5ß1: part 2. Bioorg Med Chem Lett 22:4117-21 (2012)  
Target
Name:
Integrin alpha-V/beta-3
Synonyms:
ITGAV/ITGB3 | Integrin beta-3/Vitronectin receptor alpha
Type:
Enzyme
Mol. Mass.:
Description:
Components:
This complex has 2 components.
Component 1
Name:
Integrin alpha-V
Synonyms:
ITAV_HUMAN Integrin alpha-V/alpha-5 VNRA Vitronectin receptor | Vitronectin receptor subunit alpha
Type:
PROTEIN
Mol. Mass.:
116024.92
Organism:
Homo sapiens (Human)
Description:
ChEMBL_582336
Residue:
1048
  
Component 2
Name:
Integrin beta-3
Synonyms:
CD_antigen=CD61 GPIIIa ITGB3 Platelet membrane glycoprotein IIIa
Type:
Protein
Mol. Mass.:
87038.91
Organism:
Homo sapiens (Human)
Description:
P05106
Residue:
788
  
Inhibitor
Name:
BDBM50134778
Synonyms:
(S)-3-(6-Methoxy-pyridin-3-yl)-3-{2-oxo-3-[3-(5,6,7,8-tetrahydro-[1,8]naphthyridin-2-yl)-propyl]-imidazolidin-1-yl}-propionic acid CHEMBL145085 | US11685738, Compound A30s
Type:
Small organic molecule
Emp. Form.:
C23H29N5O4
Mol. Mass.:
439.5075
SMILES:
COc1ccc(cn1)[C@H](CC(O)=O)N1CCN(CCCc2ccc3CCCNc3n2)C1=O
: