Target
Integrin alpha-5/beta-1
Ligand
BDBM50383796
Substrate
Meas. Tech.
ChEMBL_819396 (CHEMBL2033063)
IC50
21±n/a nM
Citation
 Delouvrié, BAl-Kadhimi, KArnould, JCBarry, STCross, DADidelot, MGavine, PRGermain, HHarris, CSHughes, AMJude, DAKendrew, JLambert-van der Brempt, CLohmann, JJMénard, MMortlock, AAPass, MRooney, CVautier, MVincent, JLWarin, N Structure-activity relationship of a series of non peptidic RGD integrin antagonists targetinga5ß1: part 2. Bioorg Med Chem Lett 22:4117-21 (2012)  
Target
Name:
Integrin alpha-5/beta-1
Synonyms:
Fibronectin receptor alpha/beta ITGA5/ITGB1
Type:
Enzyme
Mol. Mass.:
Description:
Components:
This complex has 2 components.
Component 1
Name:
Integrin alpha-5
Synonyms:
CD49 antigen-like family member E FNRA Fibronectin receptor subunit alpha ITGA5 Integrin alpha-F | VLA-5
Type:
Single-pass type I membrane protein
Mol. Mass.:
114523.00
Organism:
Homo sapiens (Human)
Description:
Residue:
1049
  
Component 2
Name:
Integrin beta-1
Synonyms:
CD_antigen=CD29 Fibronectin receptor beta GPIIA ITGB1 MDF2 | MSK12
Type:
Enzyme
Mol. Mass.:
88400.38
Organism:
Homo sapiens (Human)
Description:
P05556
Residue:
798
  
Inhibitor
Name:
BDBM50383796
Synonyms:
CHEMBL2030962
Type:
Small organic molecule
Emp. Form.:
C26H27Cl2N3O4
Mol. Mass.:
516.416
SMILES:
CNc1cccc(CCOc2c(C)cc(C[C@H](NC(=O)c3c(Cl)cccc3Cl)C(O)=O)cc2C)n1
: