Target
Integrin alpha-5/beta-1
Ligand
BDBM50383860
Substrate
Meas. Tech.
ChEMBL_819478 (CHEMBL2033283)
IC50
140±n/a nM
Citation
 Delouvrié, BAl-Kadhimi, KArnould, JCBarry, STCross, DADidelot, MGavine, PRGermain, HHarris, CSHughes, AMJude, DAKendrew, JLambert-van der Brempt, CLohmann, JJMénard, MMortlock, AAPass, MRooney, CVautier, MVincent, JLWarin, N Structure-activity relationship of a series of non peptidic RGD integrin antagonists targetinga5ß1: part 1. Bioorg Med Chem Lett 22:4111-6 (2012)  
Target
Name:
Integrin alpha-5/beta-1
Synonyms:
Fibronectin receptor alpha/beta ITGA5/ITGB1
Type:
Enzyme
Mol. Mass.:
Description:
Components:
This complex has 2 components.
Component 1
Name:
Integrin alpha-5
Synonyms:
CD49 antigen-like family member E FNRA Fibronectin receptor subunit alpha ITGA5 Integrin alpha-F | VLA-5
Type:
Single-pass type I membrane protein
Mol. Mass.:
114523.00
Organism:
Homo sapiens (Human)
Description:
Residue:
1049
  
Component 2
Name:
Integrin beta-1
Synonyms:
CD_antigen=CD29 Fibronectin receptor beta GPIIA ITGB1 MDF2 | MSK12
Type:
Enzyme
Mol. Mass.:
88400.38
Organism:
Homo sapiens (Human)
Description:
P05556
Residue:
798
  
Inhibitor
Name:
BDBM50383860
Synonyms:
CHEMBL2031171
Type:
Small organic molecule
Emp. Form.:
C25H25Cl2N3O4
Mol. Mass.:
502.39
SMILES:
CN(C)c1cccc(CCOc2ccc(C[C@H](NC(=O)c3c(Cl)cccc3Cl)C(O)=O)cc2)n1
: