Target
11-beta-hydroxysteroid dehydrogenase 1
Ligand
BDBM50384520
Substrate
Meas. Tech.
ChEMBL_821912 (CHEMBL2039558)
IC50
1±n/a nM
Citation
 Kim, SHBok, JHLee, JHKim, IHKwon, SWLee, GBKang, SKPark, JSJung, WHKim, HYRhee, SDAhn, SHBae, MAHa, DCKim, KYAhn, JH Synthesis and biological evaluation of cyclic sulfamide derivatives as 11ß-hydroxysteroid dehydrogenase 1 inhibitors. ACS Med Chem Lett 3:88-93 (2012)  
Target
Name:
11-beta-hydroxysteroid dehydrogenase 1
Synonyms:
11-DH 11-beta-Hydroxysteroid Dehydrogenase 1 (11-beta-HSD1) 11-beta-hydroxysteroid dehydrogenase 1 (11HSD1) Corticosteroid 11-beta-dehydrogenase isozyme 1 (11-beta-HSD-1) Corticosteroid 11-beta-dehydrogenase isozyme 1 (11beta-HSD1) HSD11 HSD11L | SDR26C1
Type:
Enzyme
Mol. Mass.:
32409.16
Organism:
Homo sapiens (Human)
Description:
P28845
Residue:
292
  
Inhibitor
Name:
BDBM50384520
Synonyms:
CHEMBL2036232
Type:
Small organic molecule
Emp. Form.:
C21H27Cl3N4O4S
Mol. Mass.:
537.887
SMILES:
CN(CC(=O)N[C@H]1C2CC3CC1C[C@](C3)(C2)C(N)=O)S(=O)(=O)N(C)c1c(Cl)cc(Cl)cc1Cl
: