Target
Serine/threonine-protein kinase pim-1
Ligand
BDBM50384713
Substrate
Meas. Tech.
ChEMBL_820887 (CHEMBL2038828)
IC50
25±n/a nM
Citation
 Haddach, MMichaux, JSchwaebe, MKPierre, FBorsan, CTran, JRaffaele, NRavula, SDrygin, DSiddiqui-Jain, ADarjania, LStansfield, RProffitt, CMacalino, DStreiner, NBliesath, JOmori, MWhitten, JPAnderes, KRice, WGRyckman, DM Discovery of CX-6258. A Potent, Selective, and Orally Efficacious pan-Pim Kinases Inhibitor. ACS Med Chem Lett 3:135-139 (2012)  
Target
Name:
Serine/threonine-protein kinase pim-1
Synonyms:
PIM-1 Kinase PIM1_HUMAN Serine/threonine-protein kinase (PIM1) Serine/threonine-protein kinase PIM1 | Serine/threonine-protein kinase pim-1 (PIM1)
Type:
Protein
Mol. Mass.:
35681.82
Organism:
Homo sapiens (Human)
Description:
P11309
Residue:
313
  
Inhibitor
Name:
BDBM50384713
Synonyms:
CHEMBL2037199
Type:
Small organic molecule
Emp. Form.:
C23H19ClN2O4
Mol. Mass.:
422.861
SMILES:
OCCCNC(=O)c1cccc(c1)-c1ccc(\C=C2\C(=O)Nc3ccc(Cl)cc23)o1
: