Target
Serine/threonine-protein kinase pim-2
Ligand
BDBM50384719
Substrate
Meas. Tech.
ChEMBL_820888 (CHEMBL2038829)
IC50
82±n/a nM
Citation
 Haddach, MMichaux, JSchwaebe, MKPierre, FBorsan, CTran, JRaffaele, NRavula, SDrygin, DSiddiqui-Jain, ADarjania, LStansfield, RProffitt, CMacalino, DStreiner, NBliesath, JOmori, MWhitten, JPAnderes, KRice, WGRyckman, DM Discovery of CX-6258. A Potent, Selective, and Orally Efficacious pan-Pim Kinases Inhibitor. ACS Med Chem Lett 3:135-139 (2012)  
Target
Name:
Serine/threonine-protein kinase pim-2
Synonyms:
PIM2 Pim-2h Serine/threonine-protein kinase PIM | Serine/threonine-protein kinase pim-2 (PIM2)
Type:
Serine/threonine-protein kinase
Mol. Mass.:
34185.93
Organism:
Homo sapiens (Human)
Description:
Q9P1W9
Residue:
311
  
Inhibitor
Name:
BDBM50384719
Synonyms:
CHEMBL2037206
Type:
Small organic molecule
Emp. Form.:
C28H28ClN3O3
Mol. Mass.:
489.993
SMILES:
CCC(=C1C(=O)Nc2ccc(Cl)cc12)c1ccc(o1)-c1cccc(c1)C(=O)N1CCCN(C)CC1
: