Target
Serine/threonine-protein kinase pim-3
Ligand
BDBM50384715
Substrate
Meas. Tech.
ChEMBL_820895 (CHEMBL2038836)
IC50
>1000±n/a nM
Citation
 Haddach, MMichaux, JSchwaebe, MKPierre, FBorsan, CTran, JRaffaele, NRavula, SDrygin, DSiddiqui-Jain, ADarjania, LStansfield, RProffitt, CMacalino, DStreiner, NBliesath, JOmori, MWhitten, JPAnderes, KRice, WGRyckman, DM Discovery of CX-6258. A Potent, Selective, and Orally Efficacious pan-Pim Kinases Inhibitor. ACS Med Chem Lett 3:135-139 (2012)  
Target
Name:
Serine/threonine-protein kinase pim-3
Synonyms:
PIM3 Serine/threonine-protein kinase pim-3 (PIM3)
Type:
Protein
Mol. Mass.:
35888.19
Organism:
Homo sapiens (Human)
Description:
Q86V86
Residue:
326
  
Inhibitor
Name:
BDBM50384715
Synonyms:
CHEMBL2037201
Type:
Small organic molecule
Emp. Form.:
C25H22ClN3O3
Mol. Mass.:
447.913
SMILES:
Clc1ccc2NC(=O)\C(=C\c3ccc(o3)-c3cccc(c3)C(=O)N3CCCNCC3)c2c1
: