Target
Serine/threonine-protein kinase pim-1
Ligand
BDBM50384719
Substrate
Meas. Tech.
ChEMBL_820887 (CHEMBL2038828)
IC50
131±n/a nM
Citation
 Haddach, MMichaux, JSchwaebe, MKPierre, FBorsan, CTran, JRaffaele, NRavula, SDrygin, DSiddiqui-Jain, ADarjania, LStansfield, RProffitt, CMacalino, DStreiner, NBliesath, JOmori, MWhitten, JPAnderes, KRice, WGRyckman, DM Discovery of CX-6258. A Potent, Selective, and Orally Efficacious pan-Pim Kinases Inhibitor. ACS Med Chem Lett 3:135-139 (2012)  
Target
Name:
Serine/threonine-protein kinase pim-1
Synonyms:
PIM-1 Kinase PIM1_HUMAN Serine/threonine-protein kinase (PIM1) Serine/threonine-protein kinase PIM1 | Serine/threonine-protein kinase pim-1 (PIM1)
Type:
Protein
Mol. Mass.:
35681.82
Organism:
Homo sapiens (Human)
Description:
P11309
Residue:
313
  
Inhibitor
Name:
BDBM50384719
Synonyms:
CHEMBL2037206
Type:
Small organic molecule
Emp. Form.:
C28H28ClN3O3
Mol. Mass.:
489.993
SMILES:
CCC(=C1C(=O)Nc2ccc(Cl)cc12)c1ccc(o1)-c1cccc(c1)C(=O)N1CCCN(C)CC1
: