Target
Serine/threonine-protein kinase pim-2
Ligand
BDBM50384710
Substrate
Meas. Tech.
ChEMBL_820888 (CHEMBL2038829)
IC50
127±n/a nM
Citation
 Haddach, MMichaux, JSchwaebe, MKPierre, FBorsan, CTran, JRaffaele, NRavula, SDrygin, DSiddiqui-Jain, ADarjania, LStansfield, RProffitt, CMacalino, DStreiner, NBliesath, JOmori, MWhitten, JPAnderes, KRice, WGRyckman, DM Discovery of CX-6258. A Potent, Selective, and Orally Efficacious pan-Pim Kinases Inhibitor. ACS Med Chem Lett 3:135-139 (2012)  
Target
Name:
Serine/threonine-protein kinase pim-2
Synonyms:
PIM2 Pim-2h Serine/threonine-protein kinase PIM | Serine/threonine-protein kinase pim-2 (PIM2)
Type:
Serine/threonine-protein kinase
Mol. Mass.:
34185.93
Organism:
Homo sapiens (Human)
Description:
Q9P1W9
Residue:
311
  
Inhibitor
Name:
BDBM50384710
Synonyms:
CHEMBL2037196
Type:
Small organic molecule
Emp. Form.:
C26H24FN3O3
Mol. Mass.:
445.4855
SMILES:
Fc1ccc2NC(=O)\C(=C\c3ccc(o3)-c3cccc(c3)C(=O)NCCN3CCCC3)c2c1
: