Target
Collagenase 3
Ligand
BDBM50210054
Substrate
Meas. Tech.
ChEMBL_827438 (CHEMBL2051217)
IC50
29030±n/a nM
Citation
 Wang, LLi, XZhang, SLu, WLiao, SLiu, XShan, LShen, XJiang, HZhang, WHuang, JLi, H Natural products as a gold mine for selective matrix metalloproteinases inhibitors. Bioorg Med Chem 20:4164-71 (2012)  
Target
Name:
Collagenase 3
Synonyms:
MMP-13 MMP13_HUMAN Matrix metalloproteinase-13 (MMP-13) | Matrix metalloproteinase-13 (MMP13)
Type:
Enzyme
Mol. Mass.:
53808.06
Organism:
Homo sapiens (Human)
Description:
P45452
Residue:
471
  
Inhibitor
Name:
BDBM50210054
Synonyms:
(R,E)-3-(3,4-dihydroxyphenyl)-1-methoxy-1-oxopropan-2-yl 3-(3,4-dihydroxyphenyl)acrylate CHEMBL241405
Type:
Small organic molecule
Emp. Form.:
C19H18O8
Mol. Mass.:
374.3414
SMILES:
COC(=O)[C@@H](Cc1ccc(O)c(O)c1)OC(=O)\C=C\c1ccc(O)c(O)c1
: