Target
Cytochrome P450 2D6
Ligand
BDBM50387086
Substrate
Meas. Tech.
ChEMBL_827668 (CHEMBL2050707)
IC50
>100000±n/a nM
Citation
 Zhang, HZhou, LAmblard, FShi, JBobeck, DRTao, SMcBrayer, TRTharnish, PMWhitaker, TCoats, SJSchinazi, RF Synthesis and evaluation of novel potent HCV NS5A inhibitors. Bioorg Med Chem Lett 22:4864-8 (2012)  
Target
Name:
Cytochrome P450 2D6
Synonyms:
CP2D6_HUMAN CYP2DL1 Cytochrome P450 2D6 (CYP2D6) P450-DB1
Type:
Protein
Mol. Mass.:
55774.82
Organism:
Homo sapiens (Human)
Description:
P10635
Residue:
497
  
Inhibitor
Name:
BDBM50387086
Synonyms:
CHEMBL2047191
Type:
Small organic molecule
Emp. Form.:
C40H48F2N8O6
Mol. Mass.:
774.8559
SMILES:
COC(=O)N[C@@H](C(C)C)C(=O)N1CCC[C@H]1c1nc(c(F)[nH]1)-c1ccc(cc1)-c1ccc(cc1)-c1nc([nH]c1F)[C@@H]1CCCN1C(=O)[C@@H](NC(=O)OC)C(C)C
: