Target
Cytochrome P450 2C9
Ligand
BDBM50387086
Substrate
Meas. Tech.
ChEMBL_827669 (CHEMBL2050708)
IC50
>100000±n/a nM
Citation
 Zhang, HZhou, LAmblard, FShi, JBobeck, DRTao, SMcBrayer, TRTharnish, PMWhitaker, TCoats, SJSchinazi, RF Synthesis and evaluation of novel potent HCV NS5A inhibitors. Bioorg Med Chem Lett 22:4864-8 (2012)  
Target
Name:
Cytochrome P450 2C9
Synonyms:
(R)-limonene 6-monooxygenase CP2C9_HUMAN CYP2C9 Cytochrome P450 2C9 (CYP2C9 ) P-450MP P450 PB-1 | S-mephenytoin 4-hydroxylase
Type:
Enzyme
Mol. Mass.:
55636.33
Organism:
Homo sapiens (Human)
Description:
P11712
Residue:
490
  
Inhibitor
Name:
BDBM50387086
Synonyms:
CHEMBL2047191
Type:
Small organic molecule
Emp. Form.:
C40H48F2N8O6
Mol. Mass.:
774.8559
SMILES:
COC(=O)N[C@@H](C(C)C)C(=O)N1CCC[C@H]1c1nc(c(F)[nH]1)-c1ccc(cc1)-c1ccc(cc1)-c1nc([nH]c1F)[C@@H]1CCCN1C(=O)[C@@H](NC(=O)OC)C(C)C
: