Target
Melanin-concentrating hormone receptor 1
Ligand
BDBM50383112
Substrate
Meas. Tech.
ChEMBL_829934 (CHEMBL2061639)
IC50
1±n/a nM
Citation
 Kasai, SKamata, MMasada, SKunitomo, JKamaura, MOkawa, TTakami, KOgino, HNakano, YAshina, SWatanabe, KKaisho, TImai, YNRyu, SNakayama, MNagisa, YTakekawa, SKato, KMurata, TSuzuki, NIshihara, Y Synthesis, structure-activity relationship, and pharmacological studies of novel melanin-concentrating hormone receptor 1 antagonists 3-aminomethylquinolines: reducing human ether-a-go-go-related gene (hERG) associated liabilities. J Med Chem 55:4336-51 (2012)  
Target
Name:
Melanin-concentrating hormone receptor 1
Synonyms:
G-protein coupled receptor 24 MCH receptor 1 MCH-R1 MCHR MCHR1_RAT Melanin Concentrating Hormone 1 Melanin-concentrating hormone receptor 1 Slc1 | Somatostatin receptor-like protein
Type:
Enzyme Catalytic Domain
Mol. Mass.:
39075.64
Organism:
RAT
Description:
Melanin Concentrating Hormone 1 GPR24 RAT::P97639
Residue:
353
  
Inhibitor
Name:
BDBM50383112
Synonyms:
CHEMBL2029372
Type:
Small organic molecule
Emp. Form.:
C28H26FN3O
Mol. Mass.:
439.5239
SMILES:
Cc1c(NC(=O)c2ccc(cc2)-c2ccc(F)cc2)ccc2cc(CN3CCCC3)cnc12
: