Target
Melanin-concentrating hormone receptor 1
Ligand
BDBM50388442
Substrate
Meas. Tech.
ChEMBL_829933 (CHEMBL2061638)
IC50
2±n/a nM
Citation
 Kasai, SKamata, MMasada, SKunitomo, JKamaura, MOkawa, TTakami, KOgino, HNakano, YAshina, SWatanabe, KKaisho, TImai, YNRyu, SNakayama, MNagisa, YTakekawa, SKato, KMurata, TSuzuki, NIshihara, Y Synthesis, structure-activity relationship, and pharmacological studies of novel melanin-concentrating hormone receptor 1 antagonists 3-aminomethylquinolines: reducing human ether-a-go-go-related gene (hERG) associated liabilities. J Med Chem 55:4336-51 (2012)  
Target
Name:
Melanin-concentrating hormone receptor 1
Synonyms:
G-protein coupled receptor 24 MCH receptor 1 MCH-R1 MCHR-1 MCHR1_HUMAN Melanin-Concentrating Hormone Receptor 1 (MCH1R) Melanin-concentrating hormone receptor 1 (MCH-1) Melanin-concentrating hormone receptor 1 (MCHR-1) SLC-1 Somatostatin receptor-like protein
Type:
G Protein-Coupled Receptor (GPCR)
Mol. Mass.:
45976.27
Organism:
Homo sapiens (Human)
Description:
Membranes from CHO-K1 cells stably expressing human MCH1R were used in assays.
Residue:
422
  
Inhibitor
Name:
BDBM50388442
Synonyms:
CHEMBL2059408
Type:
Small organic molecule
Emp. Form.:
C26H31N3O2
Mol. Mass.:
417.5432
SMILES:
CCCCOc1ccc(cc1)C(=O)Nc1ccc2cc(CN3CCCC3)cnc2c1C
: