Target
Biotin--protein ligase
Ligand
BDBM50388935
Substrate
Meas. Tech.
ChEMBL_831149 (CHEMBL2065962)
Ki
12000±n/a nM
Citation
 Soares da Costa, TPTieu, WYap, MYZvarec, OBell, JMTurnidge, JDWallace, JCBooker, GWWilce, MCAbell, ADPolyak, SW Biotin analogues with antibacterial activity are potent inhibitors of biotin protein ligase. ACS Med Chem Lett 3:509-514 (2012)  
Target
Name:
Biotin--protein ligase
Synonyms:
BPL1_HUMAN Biotin--[acetyl-CoA-carboxylase] ligase Biotin--[methylmalonyl-CoA-carboxytransferase] ligase HCS Holocarboxylase synthetase
Type:
PROTEIN
Mol. Mass.:
80745.43
Organism:
Homo sapiens (Human)
Description:
ChEMBL_1475435
Residue:
726
  
Inhibitor
Name:
BDBM50388935
Synonyms:
CHEMBL2063405
Type:
Small organic molecule
Emp. Form.:
C13H20N2OS
Mol. Mass.:
252.376
SMILES:
O=C1N[C@H]2CS[C@@H](CCCCCCC#C)[C@H]2N1
: