Target
Somatostatin receptor type 3
Ligand
BDBM50389592
Substrate
Meas. Tech.
ChEMBL_833940 (CHEMBL2072626)
Ki
1.7±n/a nM
Citation
 Pasternak, AFeng, Zde Jesus, RYe, ZHe, SDobbelaar, PBradley, SAChicchi, GGTsao, KLTrusca, DEiermann, GJLi, CFeng, YWu, MShao, QZhang, BBNargund, RMills, SGHoward, ADYang, LZhou, YP Stimulation of Glucose-Dependent Insulin Secretion by a Potent, Selective sst3 Antagonist. ACS Med Chem Lett 3:289-293 (2012)  
Target
Name:
Somatostatin receptor type 3
Synonyms:
SOMATOSTATIN SST3 SS3-R SSR-28 SSTR3 | Somatostatin receptor type 3 (SSTR3)
Type:
Protein
Mol. Mass.:
45855.97
Organism:
Homo sapiens (Human)
Description:
P32745
Residue:
418
  
Inhibitor
Name:
BDBM50389592
Synonyms:
CHEMBL2069500
Type:
Small organic molecule
Emp. Form.:
C26H28N4
Mol. Mass.:
396.5273
SMILES:
C1CCC(CC1)C1N[C@H](Cc2c1[nH]c1ccccc21)c1nc(c[nH]1)-c1ccccc1
: