Target
Indoleamine 2,3-dioxygenase 1
Ligand
BDBM50391360
Substrate
Meas. Tech.
ChEMBL_847931 (CHEMBL2150231)
IC50
2900±n/a nM
Citation
 Röhrig, UFMajjigapu, SRGrosdidier, ABron, SStroobant, VPilotte, LColau, DVogel, PVan den Eynde, BJZoete, VMichielin, O Rational design of 4-aryl-1,2,3-triazoles for indoleamine 2,3-dioxygenase 1 inhibition. J Med Chem 55:5270-90 (2012)  
Target
Name:
Indoleamine 2,3-dioxygenase 1
Synonyms:
I23O1_HUMAN IDO-1 INDO Indoleamine 2,3-dioxygenase | Indoleamine-pyrrole 2,3-dioxygenase
Type:
Enzyme
Mol. Mass.:
45330.80
Organism:
Homo sapiens (Human)
Description:
P14902
Residue:
403
  
Inhibitor
Name:
BDBM50391360
Synonyms:
CHEMBL2147995
Type:
Small organic molecule
Emp. Form.:
C7H5BrN4
Mol. Mass.:
225.045
SMILES:
Brc1cc(ccn1)-c1c[nH]nn1
: