Target
Phosphatidylinositol 4,5-bisphosphate 3-kinase catalytic subunit delta isoform
Ligand
BDBM50392146
Substrate
Meas. Tech.
ChEMBL_851649 (CHEMBL2157248)
IC50
4±n/a nM
Citation
 Sutherlin, DPBaker, SBisconte, ABlaney, PMBrown, AChan, BKChantry, DCastanedo, GDePledge, PGoldsmith, PGoldstein, DMHancox, TKaur, JKnowles, DKondru, RLesnick, JLucas, MCLewis, CMurray, JNadin, AJNonomiya, JPang, JPegg, NPrice, SReif, KSafina, BSSalphati, LStaben, SSeward, EMShuttleworth, SSohal, SSweeney, ZKUltsch, MWaszkowycz, BWei, B Potent and selective inhibitors of PI3Kd: obtaining isoform selectivity from the affinity pocket and tryptophan shelf. Bioorg Med Chem Lett 22:4296-302 (2012)  
Target
Name:
Phosphatidylinositol 4,5-bisphosphate 3-kinase catalytic subunit delta isoform
Synonyms:
PI3-kinase p110 subunit delta PI3-kinase subunit p110-delta PIK3CD Phosphatidylinositol 4,5-biphosphate 3-kinase catalytic subunit delta (PIK3CD) Phosphatidylinositol 4,5-bisphosphate 3-kinase 110 kDa catalytic subunit delta (PI3K delta) Phosphatidylinositol 4,5-bisphosphate 3-kinase catalytic subunit delta (PI3Kdelta) Phosphatidylinositol 4,5-bisphosphate 3-kinase catalytic subunit delta isoform (PI3K delta) Phosphatidylinositol 4,5-bisphosphate 3-kinase catalytic subunit delta isoform (PI3K-delta) Phosphatidylinositol 4,5-bisphosphate 3-kinase catalytic subunit delta isoform (PI3Kdelta)
Type:
Enzyme Subunit
Mol. Mass.:
119489.41
Organism:
Homo sapiens (Human)
Description:
O00329
Residue:
1044
  
Inhibitor
Name:
BDBM50392146
Synonyms:
CHEMBL2152776
Type:
Small organic molecule
Emp. Form.:
C27H32FN5O2S
Mol. Mass.:
509.639
SMILES:
CC(C)(O)C1CCN(Cc2cc3nc(nc(N4CCOCC4)c3s2)-c2c(F)ccc3[nH]ccc23)CC1
: