Target
Coagulation factor X
Ligand
BDBM50392597
Substrate
Meas. Tech.
ChEMBL_854009 (CHEMBL2155306)
IC50
6.4±n/a nM
Citation
 Pandya, VJain, MChakrabarti, GSoni, HParmar, BChaugule, BPatel, JJarag, TJoshi, JJoshi, NRath, AUnadkat, VSharma, BAjani, HKumar, JSairam, KVPatel, HPatel, P Synthesis and structure-activity relationship of potent, selective and orally active anthranilamide-based factor Xa inhibitors: application of weakly basic sulfoximine group as novel S4 binding element. Eur J Med Chem 58:136-52 (2012)  
Target
Name:
Coagulation factor X
Synonyms:
Activated coagulation factor X (FXa) Coagulation factor X precursor F10 Factor X heavy chain Factor Xa Stuart-Prower factor
Type:
Enzyme
Mol. Mass.:
54726.60
Organism:
Homo sapiens (Human)
Description:
Residue:
488
  
Inhibitor
Name:
BDBM50392597
Synonyms:
CHEMBL2153394
Type:
Small organic molecule
Emp. Form.:
C27H27Cl2N5O5S
Mol. Mass.:
604.505
SMILES:
COc1cc(Cl)cc(C(=O)Nc2ccc(Cl)cn2)c1NC(=O)c1ccc(cc1)S(=C)(=O)NC(=O)CN1CCCC1
: