Target
Beta-secretase 1
Ligand
BDBM50392774
Substrate
Meas. Tech.
ChEMBL_853105 (CHEMBL2154573)
IC50
370±n/a nM
Citation
 Kaller, MRHarried, SSAlbrecht, BAmarante, PBabu-Khan, SBartberger, MDBrown, JBrown, RChen, KCheng, YCitron, MCroghan, MDGraceffa, RHickman, DJudd, TKriemen, CLa, DLi, VLopez, PLuo, YMasse, CMonenschein, HNguyen, TPennington, LDMiguel, TSSickmier, EAWahl, RCWeiss, MMWen, PHWilliamson, TWood, SXue, MYang, BZhang, JPatel, VZhong, WHitchcock, S A Potent and Orally Efficacious, Hydroxyethylamine-Based Inhibitor of ß-Secretase. ACS Med Chem Lett 3:886-891 (2012)  
Target
Name:
Beta-secretase 1
Synonyms:
ASP2 Aspartyl protease 2 BACE1 Beta-secretase (BACE) Beta-secretase 1 (BACE 1) Beta-secretase 1 (BACE1) Beta-site amyloid precursor protein cleaving enzyme 1 Memapsin-2 beta-Secretase (BACE-1) | beta-Secretase (BACE1)
Type:
Protein
Mol. Mass.:
55755.10
Organism:
Homo sapiens (Human)
Description:
P56817
Residue:
501
  
Inhibitor
Name:
BDBM50392774
Synonyms:
CHEMBL2151149
Type:
Small organic molecule
Emp. Form.:
C26H34N2O3
Mol. Mass.:
422.5598
SMILES:
CCc1ccc2OC3(CCC3)C[C@H](NC[C@@H](O)[C@H](Cc3ccccc3)NC(C)=O)c2c1
: