Target
Acyl-CoA 6-desaturase
Ligand
BDBM50393164
Substrate
Meas. Tech.
ChEMBL_852950 (CHEMBL2154134)
IC50
>100000000±n/a nM
Citation
 Oballa, RMBelair, LBlack, WCBleasby, KChan, CCDesroches, CDu, XGordon, RGuay, JGuiral, SHafey, MJHamelin, EHuang, ZKennedy, BLachance, NLandry, FLi, CSMancini, JNormandin, DPocai, APowell, DARamtohul, YKSkorey, KSørensen, DSturkenboom, WStyhler, AWaddleton, DMWang, HWong, SXu, LZhang, L Development of a liver-targeted stearoyl-CoA desaturase (SCD) inhibitor (MK-8245) to establish a therapeutic window for the treatment of diabetes and dyslipidemia. J Med Chem 54:5082-96 (2011)  
Target
Name:
Acyl-CoA 6-desaturase
Synonyms:
FADS2_RAT Fadsd6 | Fatty acid desaturase 2
Type:
PROTEIN
Mol. Mass.:
52399.93
Organism:
Rattus norvegicus
Description:
ChEMBL_852950
Residue:
444
  
Inhibitor
Name:
BDBM50393164
Synonyms:
CHEMBL2153599
Type:
Small organic molecule
Emp. Form.:
C15H14F3N7OS
Mol. Mass.:
397.378
SMILES:
FC(F)(F)c1ccccc1OC1CCN(CC1)c1nnc(s1)-c1nnn[nH]1
: