Target
Sodium channel protein type 5 subunit alpha
Ligand
BDBM50357205
Substrate
Meas. Tech.
ChEMBL_857214 (CHEMBL2160410)
IC50
>5000±n/a nM
Citation
 Lowes, DPradhan, AIyer, LVParman, TGow, JZhu, FFurimsky, ALemoff, AGuiguemde, WASigal, MClark, JAWilson, ETang, LConnelly, MCDerisi, JLKyle, DEMirsalis, JGuy, RK Lead optimization of antimalarial propafenone analogues. J Med Chem 55:6087-93 (2012)  
Target
Name:
Sodium channel protein type 5 subunit alpha
Synonyms:
HH1 SCN5A_HUMAN Sodium channel protein type 5 subunit alpha/beta-1/beta-2 Voltage-gated sodium channel subunit alpha Nav1.5
Type:
Enzyme
Mol. Mass.:
226908.60
Organism:
Homo sapiens (Human)
Description:
Q14524
Residue:
2016
  
Inhibitor
Name:
BDBM50357205
Synonyms:
CHEMBL1914844 | CHEMBL1963594
Type:
Small organic molecule
Emp. Form.:
C29H34N2O3
Mol. Mass.:
458.5919
SMILES:
Cc1ccc(cc1)N1CCN(CC(O)COc2ccccc2C(=O)CCc2ccccc2)CC1
: