Target
Histamine H4 receptor
Ligand
BDBM50394703
Substrate
Meas. Tech.
ChEMBL_858635 (CHEMBL2166517)
EC50
8.51±n/a nM
Citation
 Birnkammer, TSpickenreither, ABrunskole, ILopuch, MKagermeier, NBernhardt, GDove, SSeifert, RElz, SBuschauer, A The bivalent ligand approach leads to highly potent and selective acylguanidine-type histamine H2 receptor agonists. J Med Chem 55:1147-60 (2012)  
Target
Name:
Histamine H4 receptor
Synonyms:
AXOR35 GPCR105 HH4R HRH4 Histamine H4 receptor Histamine receptor (H3 and H4) SP9144
Type:
G Protein-Coupled Receptor (GPCR)
Mol. Mass.:
44517.02
Organism:
Homo sapiens (Human)
Description:
Binding assays were using CHO cells stably expressing hH4R receptors.
Residue:
390
  
Inhibitor
Name:
BDBM50394703
Synonyms:
CHEMBL2165628
Type:
Small organic molecule
Emp. Form.:
C25H42N10O2S
Mol. Mass.:
546.732
SMILES:
Cc1nc(N)sc1CCCN=C(N)NC(=O)CCCCCCCCC(=O)NC(N)=NCCCc1cnc[nH]1
: