Target
Histamine H4 receptor
Ligand
BDBM50394694
Substrate
Meas. Tech.
ChEMBL_858635 (CHEMBL2166517)
EC50
8.51±n/a nM
Citation
 Birnkammer, TSpickenreither, ABrunskole, ILopuch, MKagermeier, NBernhardt, GDove, SSeifert, RElz, SBuschauer, A The bivalent ligand approach leads to highly potent and selective acylguanidine-type histamine H2 receptor agonists. J Med Chem 55:1147-60 (2012)  
Target
Name:
Histamine H4 receptor
Synonyms:
AXOR35 GPCR105 HH4R HRH4 Histamine H4 receptor Histamine receptor (H3 and H4) SP9144
Type:
G Protein-Coupled Receptor (GPCR)
Mol. Mass.:
44517.02
Organism:
Homo sapiens (Human)
Description:
Binding assays were using CHO cells stably expressing hH4R receptors.
Residue:
390
  
Inhibitor
Name:
BDBM50394694
Synonyms:
CHEMBL2165642
Type:
Small organic molecule
Emp. Form.:
C24H40N10O2
Mol. Mass.:
500.6402
SMILES:
NC(NC(=O)CCCCCCCCC(=O)NC(=N)NCCCc1cnc[nH]1)=NCCCc1cnc[nH]1
: