Target
Urea transporter 1
Ligand
BDBM50394967
Substrate
Meas. Tech.
ChEMBL_858438 (CHEMBL2168840)
IC50
104±n/a nM
Citation
 Anderson, MOZhang, JLiu, YYao, CPhuan, PWVerkman, AS Nanomolar potency and metabolically stable inhibitors of kidney urea transporter UT-B. J Med Chem 55:5942-50 (2012)  
Target
Name:
Urea transporter 1
Synonyms:
Slc14a1 UT-B Urea transporter B | Urea transporter, erythrocyte
Type:
PROTEIN
Mol. Mass.:
42130.98
Organism:
Mus musculus
Description:
ChEMBL_964780
Residue:
384
  
Inhibitor
Name:
BDBM50394967
Synonyms:
CHEMBL2165784
Type:
Small organic molecule
Emp. Form.:
C19H15N5O3S3
Mol. Mass.:
457.549
SMILES:
COc1ccc(cc1)S(=O)(=O)c1nnn2c3ccsc3c(NCc3cccs3)nc12
: