Target
Chloroquine resistance transporter
Ligand
BDBM50396333
Substrate
Meas. Tech.
ChEMBL_864478 (CHEMBL2176281)
IC50
10500±n/a nM
Citation
 Gemma, SCamodeca, CSanna Coccone, SJoshi, BPBernetti, MMoretti, VBrogi, SBonache de Marcos, MCSavini, LTaramelli, DBasilico, NParapini, SRottmann, MBrun, RLamponi, SCaccia, SGuiso, GSummers, RLMartin, RESaponara, SGorelli, BNovellino, ECampiani, GButini, S Optimization of 4-aminoquinoline/clotrimazole-based hybrid antimalarials: further structure-activity relationships, in vivo studies, and preliminary toxicity profiling. J Med Chem 55:6948-67 (2012)  
Target
Name:
Chloroquine resistance transporter
Synonyms:
CRT PfCRT
Type:
PROTEIN
Mol. Mass.:
48687.29
Organism:
Plasmodium falciparum
Description:
ChEMBL_1364181
Residue:
424
  
Inhibitor
Name:
BDBM50396333
Synonyms:
CHEMBL2170036
Type:
Small organic molecule
Emp. Form.:
C27H26Cl2N4
Mol. Mass.:
477.428
SMILES:
Clc1cccc(c1)C(Nc1ccnc2cc(Cl)ccc12)c1ccc(CN2CCNCC2)cc1
: