Target
Eukaryotic translation initiation factor 2-alpha kinase 3
Ligand
BDBM50396547
Substrate
Meas. Tech.
ChEMBL_862854 (CHEMBL2172956)
IC50
7.4±n/a nM
Citation
 Axten, JMMedina, JRFeng, YShu, ARomeril, SPGrant, SWLi, WHHeerding, DAMinthorn, EMencken, TAtkins, CLiu, QRabindran, SKumar, RHong, XGoetz, AStanley, TTaylor, JDSigethy, SDTomberlin, GHHassell, AMKahler, KMShewchuk, LMGampe, RT Discovery of 7-methyl-5-(1-{[3-(trifluoromethyl)phenyl]acetyl}-2,3-dihydro-1H-indol-5-yl)-7H-pyrrolo[2,3-d]pyrimidin-4-amine (GSK2606414), a potent and selective first-in-class inhibitor of protein kinase R (PKR)-like endoplasmic reticulum kinase (PERK). J Med Chem 55:7193-207 (2012)  
Target
Name:
Eukaryotic translation initiation factor 2-alpha kinase 3
Synonyms:
E2AK3_HUMAN HsPEK PERK Pancreatic endoplasmic reticulum kinase (PERK)
Type:
Enzyme
Mol. Mass.:
125190.66
Organism:
Homo sapiens (Human)
Description:
Q9NZJ5
Residue:
1116
  
Inhibitor
Name:
BDBM50396547
Synonyms:
CHEMBL2171136
Type:
Small organic molecule
Emp. Form.:
C22H16F2N4O2
Mol. Mass.:
406.3848
SMILES:
Nc1ncnc2occ(-c3ccc4N(CCc4c3)C(=O)Cc3cc(F)ccc3F)c12
: