Target
Serine/threonine-protein kinase WNK2
Ligand
BDBM50396534
Substrate
Meas. Tech.
ChEMBL_862676 (CHEMBL2174224)
IC50
3892±n/a nM
Citation
 Axten, JMMedina, JRFeng, YShu, ARomeril, SPGrant, SWLi, WHHeerding, DAMinthorn, EMencken, TAtkins, CLiu, QRabindran, SKumar, RHong, XGoetz, AStanley, TTaylor, JDSigethy, SDTomberlin, GHHassell, AMKahler, KMShewchuk, LMGampe, RT Discovery of 7-methyl-5-(1-{[3-(trifluoromethyl)phenyl]acetyl}-2,3-dihydro-1H-indol-5-yl)-7H-pyrrolo[2,3-d]pyrimidin-4-amine (GSK2606414), a potent and selective first-in-class inhibitor of protein kinase R (PKR)-like endoplasmic reticulum kinase (PERK). J Med Chem 55:7193-207 (2012)  
Target
Name:
Serine/threonine-protein kinase WNK2
Synonyms:
KIAA1760 SDCCAG43 WNK2_HUMAN
Type:
Protein
Mol. Mass.:
242660.61
Organism:
Homo sapiens (Human)
Description:
Q9Y3S1
Residue:
2297
  
Inhibitor
Name:
BDBM50396534
Synonyms:
CHEMBL2171124
Type:
Small organic molecule
Emp. Form.:
C24H20F3N5O
Mol. Mass.:
451.4437
SMILES:
Cn1cc(-c2ccc3N(CCc3c2)C(=O)Cc2cccc(c2)C(F)(F)F)c2c(N)ncnc12
: