Target
Hepatocyte growth factor receptor
Ligand
BDBM50396937
Substrate
Meas. Tech.
ChEMBL_863095 (CHEMBL2175491)
Ki
61.7±n/a nM
Citation
 Cui, JJMcTigue, MNambu, MTran-Dubé, MPairish, MShen, HJia, LCheng, HHoffman, JLe, PJalaie, MGoetz, GHRyan, KGrodsky, NDeng, YLParker, MTimofeevski, SMurray, BWYamazaki, SAguirre, SLi, QZou, HChristensen, J Discovery of a novel class of exquisitely selective mesenchymal-epithelial transition factor (c-MET) protein kinase inhibitors and identification of the clinical candidate 2-(4-(1-(quinolin-6-ylmethyl)-1H-[1,2,3]triazolo[4,5-b]pyrazin-6-yl)-1H-pyrazol-1-yl)ethanol (PF-04217903) for the treatment of J Med Chem 55:8091-109 (2012)  
Target
Name:
Hepatocyte growth factor receptor
Synonyms:
Hepatocyte growth factor receptor Hepatocyte growth factor receptor (c-MET) MET Met proto-oncogene (hepatocyte growth factor receptor) Tyrosine-protein kinase Met (c-Met) c-Met kinase
Type:
Protein
Mol. Mass.:
155559.73
Organism:
Homo sapiens (Human)
Description:
P08581
Residue:
1390
  
Inhibitor
Name:
BDBM50396937
Synonyms:
CHEMBL2170948
Type:
Small organic molecule
Emp. Form.:
C23H21N9O
Mol. Mass.:
439.4725
SMILES:
O=C1CCCN1CCn1cc(cn1)-c1cnc2nnn(Cc3ccc4ncccc4c3)c2n1
: