Target
Prostaglandin G/H synthase 1
Ligand
BDBM50307794
Substrate
Meas. Tech.
ChEMBL_862036 (CHEMBL2174065)
IC50
60000±n/a nM
Citation
 Favia, ADHabrant, DScarpelli, RMigliore, MAlbani, CBertozzi, SMDionisi, MTarozzo, GPiomelli, DCavalli, ADe Vivo, M Identification and characterization of carprofen as a multitarget fatty acid amide hydrolase/cyclooxygenase inhibitor. J Med Chem 55:8807-26 (2012)  
Target
Name:
Prostaglandin G/H synthase 1
Synonyms:
COX1 Cyclooxygenase-1 (COX-1) PTGS1 | Prostaglandin G/H synthase (cyclooxygenase)
Type:
Protein
Mol. Mass.:
68868.60
Organism:
Ovis aries (Sheep)
Description:
Residue:
600
  
Inhibitor
Name:
BDBM50307794
Synonyms:
2-(4-isobutylphenyl)-N-(3-methylpyridin-2-yl)propanamide ibu-am5 (2)
Type:
Small organic molecule
Emp. Form.:
C19H24N2O
Mol. Mass.:
296.4067
SMILES:
CC(C)Cc1ccc(cc1)C(C)C(=O)Nc1ncccc1C
: