Target
Chloroquine resistance transporter
Ligand
BDBM50399930
Substrate
Meas. Tech.
ChEMBL_877808 (CHEMBL2187303)
IC50
228000±n/a nM
Citation
 Gemma, SCamodeca, CBrindisi, MBrogi, SKukreja, GKunjir, SGabellieri, ELucantoni, LHabluetzel, ATaramelli, DBasilico, NGualdani, RTadini-Buoninsegni, FBartolommei, GMoncelli, MRMartin, RESummers, RLLamponi, SSavini, LFiorini, IValoti, MNovellino, ECampiani, GButini, S Mimicking the intramolecular hydrogen bond: synthesis, biological evaluation, and molecular modeling of benzoxazines and quinazolines as potential antimalarial agents. J Med Chem 55:10387-404 (2012)  
Target
Name:
Chloroquine resistance transporter
Synonyms:
CRT PfCRT
Type:
PROTEIN
Mol. Mass.:
48687.29
Organism:
Plasmodium falciparum
Description:
ChEMBL_1364181
Residue:
424
  
Inhibitor
Name:
BDBM50399930
Synonyms:
CHEMBL2181208
Type:
Small organic molecule
Emp. Form.:
C24H21ClN4
Mol. Mass.:
400.903
SMILES:
Clc1ccc2c(Nc3ccc4CN(Cc5ccccc5)CNc4c3)ccnc2c1
: