Target
Vascular endothelial growth factor receptor 2
Ligand
BDBM50400034
Substrate
Meas. Tech.
ChEMBL_877987 (CHEMBL2189053)
Kd
70±n/a nM
Citation
 Lucas, MCGoldstein, DMHermann, JCKuglstatter, ALiu, WLuk, KCPadilla, FSlade, MVillaseñor, AGWanner, JXie, WZhang, XLiao, C Rational design of highly selective spleen tyrosine kinase inhibitors. J Med Chem 55:10414-23 (2012)  
Target
Name:
Vascular endothelial growth factor receptor 2
Synonyms:
CD_antigen=CD309 Fetal liver kinase 1 (FLK-1) KDR Protein-tyrosine kinase receptor Flk-1 VEGFR-2 VEGFR2 Vascular Endothelial Growth Factor Receptor Kinase 2 Vascular endothelial growth factor receptor 2 (KDR) Vascular endothelial growth factor receptor 2 (VEGFR2) Vascular endothelial growth factor receptor-2 (VEGFR-2)
Type:
Receptor Tyrosine Kinase
Mol. Mass.:
151510.97
Organism:
Homo sapiens (Human)
Description:
P35968
Residue:
1356
  
Inhibitor
Name:
BDBM50400034
Synonyms:
FOSTAMATINIB DISODIUM R935788 SODIUM
Type:
Small organic molecule
Emp. Form.:
C23H24FN6O9P
Mol. Mass.:
578.4447
SMILES:
COc1cc(Nc2ncc(F)c(Nc3ccc4OC(C)(C)C(=O)N(COP([O-])([O-])=O)c4n3)n2)cc(OC)c1OC
: