Target
Nitric oxide synthase, inducible
Ligand
BDBM50401271
Substrate
Meas. Tech.
ChEMBL_882959 (CHEMBL2209793)
IC50
40500±n/a nM
Citation
 Annedi, SCMaddaford, SPRamnauth, JRenton, PRybak, TSilverman, SRakhit, SMladenova, GDove, PAndrews, JSZhang, DPorreca, F Discovery of a potent, orally bioavailable and highly selective human neuronal nitric oxide synthase (nNOS) inhibitor, N-(1-(piperidin-4-yl)indolin-5-yl)thiophene-2-carboximidamide as a pre-clinical development candidate for the treatment of migraine. Eur J Med Chem 55:94-107 (2012)  
Target
Name:
Nitric oxide synthase, inducible
Synonyms:
HEP-NOS Inducible NO synthase NOS type II NOS2A Nitric oxide synthase, inducible (iNOS) | iNOS
Type:
Homodimer
Mol. Mass.:
131141.95
Organism:
Homo sapiens (Human)
Description:
P35228
Residue:
1153
  
Inhibitor
Name:
BDBM50401271
Synonyms:
CHEMBL2203713 | CHEMBL3216328
Type:
Small organic molecule
Emp. Form.:
C18H24Cl2N4S
Mol. Mass.:
399.381
SMILES:
Cl.Cl.N=C(Nc1ccc2N(CCc2c1)C1CCNCC1)c1cccs1
: