Target
Translocator protein
Ligand
BDBM50408731
Substrate
Meas. Tech.
ChEMBL_37806 (CHEMBL651181)
IC50
16.6±n/a nM
Citation
 Trapani, GFranco, MLatrofa, ARicciardi, LCarotti, ASerra, MSanna, EBiggio, GLiso, G Novel 2-phenylimidazo[1,2-a]pyridine derivatives as potent and selective ligands for peripheral benzodiazepine receptors: synthesis, binding affinity, and in vivo studies. J Med Chem 42:3934-41 (1999)  
Target
Name:
Translocator protein
Synonyms:
Benzodiazepine receptors; peripheral & central Mbr PBR Peripheral benzodiazepine receptor (PBR) TSPO_RAT | Tspo
Type:
Mitochondrion membrane protein
Mol. Mass.:
18945.84
Organism:
Rattus norvegicus (rat)
Description:
Competitive binding experiments were performed on rat kidney mitochondrial membranes.
Residue:
169
  
Inhibitor
Name:
BDBM50408731
Synonyms:
CHEMBL337917
Type:
Small organic molecule
Emp. Form.:
C23H27N3O3
Mol. Mass.:
393.4788
SMILES:
CCCN(CCC)C(=O)Cc1c(nc2ccc(cn12)C(=O)OC)-c1ccccc1
: