Target
Histidine-rich protein PFHRP-II
Ligand
BDBM50123562
Substrate
Meas. Tech.
ChEMBL_215891 (CHEMBL820823)
IC50
40.2±n/a nM
Citation
 Ryckebusch, ADeprez-Poulain, RMaes, LDebreu-Fontaine, MAMouray, EGrellier, PSergheraert, C Synthesis and in vitro and in vivo antimalarial activity of N1-(7-chloro-4-quinolyl)-1,4-bis(3-aminopropyl)piperazine derivatives. J Med Chem 46:542-57 (2003)  
Target
Name:
Histidine-rich protein PFHRP-II
Synonyms:
HRP1_PLAFA Histidine-rich protein PFHRP-II
Type:
PROTEIN
Mol. Mass.:
35156.49
Organism:
Plasmodium falciparum
Description:
ChEMBL_500704
Residue:
332
  
Inhibitor
Name:
BDBM50123562
Synonyms:
CHEMBL152635 N-(3-{4-[3-(7-Chloro-quinolin-4-ylamino)-propyl]-piperazin-1-yl}-propyl)-butyramide
Type:
Small organic molecule
Emp. Form.:
C23H34ClN5O
Mol. Mass.:
432.002
SMILES:
CCCC(=O)NCCCN1CCN(CCCNc2ccnc3cc(Cl)ccc23)CC1
: