Target
Histidine-rich protein PFHRP-II
Ligand
BDBM50123574
Substrate
Meas. Tech.
ChEMBL_215891 (CHEMBL820823)
IC50
74.9±n/a nM
Citation
 Ryckebusch, ADeprez-Poulain, RMaes, LDebreu-Fontaine, MAMouray, EGrellier, PSergheraert, C Synthesis and in vitro and in vivo antimalarial activity of N1-(7-chloro-4-quinolyl)-1,4-bis(3-aminopropyl)piperazine derivatives. J Med Chem 46:542-57 (2003)  
Target
Name:
Histidine-rich protein PFHRP-II
Synonyms:
HRP1_PLAFA Histidine-rich protein PFHRP-II
Type:
PROTEIN
Mol. Mass.:
35156.49
Organism:
Plasmodium falciparum
Description:
ChEMBL_500704
Residue:
332
  
Inhibitor
Name:
BDBM50123574
Synonyms:
CHEMBL346177 | [3-(4-{3-[Bis-(4-phenoxy-benzyl)-amino]-propyl}-piperazin-1-yl)-propyl]-(7-chloro-quinolin-4-yl)-amine
Type:
Small organic molecule
Emp. Form.:
C45H48ClN5O2
Mol. Mass.:
726.348
SMILES:
Clc1ccc2c(NCCCN3CCN(CCCN(Cc4ccc(Oc5ccccc5)cc4)Cc4ccc(Oc5ccccc5)cc4)CC3)ccnc2c1
: