Target
5-hydroxytryptamine receptor 1D
Ligand
BDBM50412126
Substrate
Meas. Tech.
ChEMBL_556307 (CHEMBL954042)
Ki
0.251189±n/a nM
Citation
 Ward, SEEddershaw, PJScott, CMGordon, LJLovell, PJMoore, SHSmith, PWStarr, KRThewlis, KMWatson, JM Discovery of potent, orally bioavailable, selective 5-HT1A/B/D receptor antagonists. J Med Chem 51:2887-90 (2008)  
Target
Name:
5-hydroxytryptamine receptor 1D
Synonyms:
5-HT-1D 5-HT1D 5HT1D_HUMAN HTR1DA Serotonin (5-HT) receptor | Serotonin Receptor 1D
Type:
G Protein-Coupled Receptor (GPCR)
Mol. Mass.:
41920.63
Organism:
Homo sapiens (Human)
Description:
Receptor binding assays were performed using human clone stably expressed in CHO cells.
Residue:
377
  
Inhibitor
Name:
BDBM50412126
Synonyms:
CHEMBL525362
Type:
Small organic molecule
Emp. Form.:
C27H34N4O2
Mol. Mass.:
446.5845
SMILES:
CCNC(=O)Nc1cccc(CC2CCN(CCOc3cccc4nc(C)ccc34)CC2)c1
: