Target
Corticotropin-releasing factor receptor 1
Ligand
BDBM50413210
Substrate
Meas. Tech.
ChEMBL_493722 (CHEMBL949477)
IC50
2344.23±n/a nM
Citation
 Di Fabio, RArban, RBernasconi, GBraggio, SBlaney, FECapelli, AMCastiglioni, EDonati, DFazzolari, ERatti, EFeriani, AContini, SGentile, GGhirlanda, DSabbatini, FMAndreotti, DSpada, SMarchioro, CWorby, ASt-Denis, Y Dihydropyrrole[2,3-d]pyridine derivatives as novel corticotropin-releasing factor-1 antagonists: mapping of the receptor binding pocket by in silico docking studies. J Med Chem 51:7273-86 (2009)  
Target
Name:
Corticotropin-releasing factor receptor 1
Synonyms:
CRF-R CRF1 CRFR1 CRH-R 1 CRHR1 Corticotropin-releasing factor receptor 1 (CRF-1) Corticotropin-releasing hormone receptor 1
Type:
Enzyme
Mol. Mass.:
50744.31
Organism:
Homo sapiens (Human)
Description:
P34998
Residue:
444
  
Inhibitor
Name:
BDBM50413210
Synonyms:
CHEMBL515070
Type:
Small organic molecule
Emp. Form.:
C20H16ClN5O2S2
Mol. Mass.:
457.956
SMILES:
CS(=O)(=O)c1ccc(N2CCc3c2nccc3-n2ccc(n2)-c2nccs2)c(Cl)c1
: