Target
Histamine H4 receptor
Ligand
BDBM50413503
Substrate
Meas. Tech.
ChEMBL_562955 (CHEMBL1015354)
EC50
7.1±n/a nM
Citation
 Igel, PSchneider, ESchnell, DElz, SSeifert, RBuschauer, A N(G)-acylated imidazolylpropylguanidines as potent histamine H4 receptor agonists: selectivity by variation of the N(G)-substituent. J Med Chem 52:2623-7 (2009)  
Target
Name:
Histamine H4 receptor
Synonyms:
AXOR35 GPCR105 HH4R HRH4 Histamine H4 receptor Histamine receptor (H3 and H4) SP9144
Type:
G Protein-Coupled Receptor (GPCR)
Mol. Mass.:
44517.02
Organism:
Homo sapiens (Human)
Description:
Binding assays were using CHO cells stably expressing hH4R receptors.
Residue:
390
  
Inhibitor
Name:
BDBM50413503
Synonyms:
CHEMBL514641 | UR-PI141
Type:
Small organic molecule
Emp. Form.:
C18H22N6O
Mol. Mass.:
338.4069
SMILES:
NC(NC(=O)CCc1c[nH]c2ccccc12)=NCCCc1cnc[nH]1
: